Target
Tyrosine-protein phosphatase non-receptor type 5
Ligand
BDBM82870
Substrate
Meas. Tech.
Dose response confirmation of uHTS small molecule inhibitors of Striatal-Enriched Phosphatase via a fluorescence intensity assay
IC50
59900±n/a nM
Citation
 PubChem, PC Dose response confirmation of uHTS small molecule inhibitors of Striatal-Enriched Phosphatase via a fluorescence intensity assay PubChem Bioassay (2012)[AID] 
Target
Name:
Tyrosine-protein phosphatase non-receptor type 5
Synonyms:
PTN5_HUMAN Tyrosine-protein phosphatase non-receptor type 5 | Tyrosine-protein phosphatase non-receptor type 5 isoform a
Type:
Enzyme Catalytic Domain
Mol. Mass.:
63510.68
Organism:
Homo sapiens (Human)
Description:
gi_90652859
Residue:
565
  
Inhibitor
Name:
BDBM82870
Synonyms:
2-(4-nitrophenoxy)-N-(5-pyridin-3-yl-1,3,4-thiadiazol-2-yl)acetamide 2-(4-nitrophenoxy)-N-[5-(3-pyridinyl)-1,3,4-thiadiazol-2-yl]acetamide MLS000767020 cid_2320014
Type:
Small organic molecule
Emp. Form.:
C15H11N5O4S
Mol. Mass.:
357.344
SMILES:
[O-][N+](=O)c1ccc(OCC(=O)Nc2nnc(s2)-c2cccnc2)cc1
: