Target
Tyrosine-protein phosphatase non-receptor type 5
Ligand
BDBM88777
Substrate
Meas. Tech.
Dose response confirmation of uHTS small molecule inhibitors of Striatal-Enriched Phosphatase via a fluorescence intensity assay
IC50
>80000±n/a nM
Citation
 PubChem, PC Dose response confirmation of uHTS small molecule inhibitors of Striatal-Enriched Phosphatase via a fluorescence intensity assay PubChem Bioassay (2012)[AID] 
Target
Name:
Tyrosine-protein phosphatase non-receptor type 5
Synonyms:
PTN5_HUMAN Tyrosine-protein phosphatase non-receptor type 5 | Tyrosine-protein phosphatase non-receptor type 5 isoform a
Type:
Enzyme Catalytic Domain
Mol. Mass.:
63510.68
Organism:
Homo sapiens (Human)
Description:
gi_90652859
Residue:
565
  
Inhibitor
Name:
BDBM88777
Synonyms:
4-[5-(2,5-dichlorophenyl)-1,2,4-oxadiazol-3-yl]pyridine 5-(2,5-dichlorophenyl)-3-pyridin-4-yl-1,2,4-oxadiazole MLS001000871 cid_895032
Type:
Small organic molecule
Emp. Form.:
C13H7Cl2N3O
Mol. Mass.:
292.12
SMILES:
Clc1ccc(Cl)c(c1)-c1nc(no1)-c1ccncc1
: