Target
Tyrosine-protein phosphatase non-receptor type 5
Ligand
BDBM82999
Substrate
Meas. Tech.
Dose response confirmation of uHTS small molecule inhibitors of Striatal-Enriched Phosphatase via a fluorescence intensity assay
IC50
56500±n/a nM
Citation
 PubChem, PC Dose response confirmation of uHTS small molecule inhibitors of Striatal-Enriched Phosphatase via a fluorescence intensity assay PubChem Bioassay (2012)[AID] 
Target
Name:
Tyrosine-protein phosphatase non-receptor type 5
Synonyms:
PTN5_HUMAN Tyrosine-protein phosphatase non-receptor type 5 | Tyrosine-protein phosphatase non-receptor type 5 isoform a
Type:
Enzyme Catalytic Domain
Mol. Mass.:
63510.68
Organism:
Homo sapiens (Human)
Description:
gi_90652859
Residue:
565
  
Inhibitor
Name:
BDBM82999
Synonyms:
4-acetyl-N-(4-fluorobenzyl)-2,3-dihydro-1,4-benzoxazine-6-sulfonamide 4-ethanoyl-N-[(4-fluorophenyl)methyl]-2,3-dihydro-1,4-benzoxazine-6-sulfonamide SMR000626853 | cid_22519415
Type:
Small organic molecule
Emp. Form.:
C17H17FN2O4S
Mol. Mass.:
364.391
SMILES:
CC(=O)N1CCOc2ccc(cc12)S(=O)(=O)NCc1ccc(F)cc1
: