Target
Tyrosine-protein phosphatase non-receptor type 5
Ligand
BDBM83143
Substrate
Meas. Tech.
Dose response confirmation of uHTS small molecule inhibitors of Striatal-Enriched Phosphatase via a fluorescence intensity assay
IC50
24900±n/a nM
Citation
 PubChem, PC Dose response confirmation of uHTS small molecule inhibitors of Striatal-Enriched Phosphatase via a fluorescence intensity assay PubChem Bioassay (2012)[AID] 
Target
Name:
Tyrosine-protein phosphatase non-receptor type 5
Synonyms:
PTN5_HUMAN Tyrosine-protein phosphatase non-receptor type 5 | Tyrosine-protein phosphatase non-receptor type 5 isoform a
Type:
Enzyme Catalytic Domain
Mol. Mass.:
63510.68
Organism:
Homo sapiens (Human)
Description:
gi_90652859
Residue:
565
  
Inhibitor
Name:
BDBM83143
Synonyms:
2-(3-methoxyanilino)-[1,3,4]thiadiazolo[2,3-b]quinazolin-5-one 2-[(3-methoxyphenyl)amino]-[1,3,4]thiadiazolo[2,3-b]quinazolin-5-one SMR001355470 | cid_23884236
Type:
Small organic molecule
Emp. Form.:
C16H12N4O2S
Mol. Mass.:
324.357
SMILES:
COc1cccc(Nc2nn3c(nc4ccccc4c3=O)s2)c1
: