Target
Dual specificity protein phosphatase 3
Ligand
BDBM88755
Substrate
Meas. Tech.
Dose Response selectivity of inhibitors of STriatal-Enriched Phosphatase (STEP) in the dual-specificity protein-tyrosine phosphatase VHR Inhibition Assay
IC50
1320±n/a nM
Citation
 PubChem, PC Dose Response selectivity of inhibitors of STriatal-Enriched Phosphatase (STEP) in the dual-specificity protein-tyrosine phosphatase VHR Inhibition Assay PubChem Bioassay (2012)[AID] 
Target
Name:
Dual specificity protein phosphatase 3
Synonyms:
DUS3_HUMAN Dual specificity protein phosphatase (VHR) Dual specificity protein phosphatase VHR Tyrosine-protein phosphatase non-receptor type 1 | VHR
Type:
Hydrolase
Mol. Mass.:
20480.58
Organism:
Homo sapiens (Human)
Description:
Residue:
185
  
Inhibitor
Name:
BDBM88755
Synonyms:
4-methyl-N-(4-sulfamoylphenyl)-1-piperazinecarbothioamide MLS000676519 SMR000299073 | cid_805196
Type:
Small organic molecule
Emp. Form.:
C12H18N4O2S2
Mol. Mass.:
314.427
SMILES:
CN1CCN(CC1)C(=S)Nc1ccc(cc1)S(N)(=O)=O
: