Target
Dual specificity protein phosphatase 3
Ligand
BDBM88759
Substrate
Meas. Tech.
Dose Response selectivity of inhibitors of STriatal-Enriched Phosphatase (STEP) in the dual-specificity protein-tyrosine phosphatase VHR Inhibition Assay
IC50
3070±n/a nM
Citation
 PubChem, PC Dose Response selectivity of inhibitors of STriatal-Enriched Phosphatase (STEP) in the dual-specificity protein-tyrosine phosphatase VHR Inhibition Assay PubChem Bioassay (2012)[AID] 
Target
Name:
Dual specificity protein phosphatase 3
Synonyms:
DUS3_HUMAN Dual specificity protein phosphatase (VHR) Dual specificity protein phosphatase VHR Tyrosine-protein phosphatase non-receptor type 1 | VHR
Type:
Hydrolase
Mol. Mass.:
20480.58
Organism:
Homo sapiens (Human)
Description:
Residue:
185
  
Inhibitor
Name:
BDBM88759
Synonyms:
MLS000664771 N-cycloheptyl-2-(cyclohexylamino)-2-sulfanylideneacetamide N-cycloheptyl-2-(cyclohexylamino)-2-thioxoacetamide cid_2974583
Type:
Small organic molecule
Emp. Form.:
C15H26N2OS
Mol. Mass.:
282.445
SMILES:
O=C(NC1CCCCCC1)C(=S)NC1CCCCC1
: