Target
Dual specificity protein phosphatase 3
Ligand
BDBM88764
Substrate
Meas. Tech.
Dose Response selectivity of inhibitors of STriatal-Enriched Phosphatase (STEP) in the dual-specificity protein-tyrosine phosphatase VHR Inhibition Assay
IC50
1120±n/a nM
Citation
 PubChem, PC Dose Response selectivity of inhibitors of STriatal-Enriched Phosphatase (STEP) in the dual-specificity protein-tyrosine phosphatase VHR Inhibition Assay PubChem Bioassay (2012)[AID] 
Target
Name:
Dual specificity protein phosphatase 3
Synonyms:
DUS3_HUMAN Dual specificity protein phosphatase (VHR) Dual specificity protein phosphatase VHR Tyrosine-protein phosphatase non-receptor type 1 | VHR
Type:
Hydrolase
Mol. Mass.:
20480.58
Organism:
Homo sapiens (Human)
Description:
Residue:
185
  
Inhibitor
Name:
BDBM88764
Synonyms:
1-(3-chloranyl-4-methoxy-phenyl)-3-(3-pyrrolidin-1-ylpropyl)thiourea 1-(3-chloro-4-methoxyphenyl)-3-(3-pyrrolidin-1-ylpropyl)thiourea MLS000730543 SMR000308819 | cid_16193058
Type:
Small organic molecule
Emp. Form.:
C15H22ClN3OS
Mol. Mass.:
327.873
SMILES:
COc1ccc(NC(=S)NCCCN2CCCC2)cc1Cl
: