Target
Dual specificity protein phosphatase 3
Ligand
BDBM88812
Substrate
Meas. Tech.
Dose Response selectivity of inhibitors of STriatal-Enriched Phosphatase (STEP) in the dual-specificity protein-tyrosine phosphatase VHR Inhibition Assay
IC50
3080±n/a nM
Citation
 PubChem, PC Dose Response selectivity of inhibitors of STriatal-Enriched Phosphatase (STEP) in the dual-specificity protein-tyrosine phosphatase VHR Inhibition Assay PubChem Bioassay (2012)[AID] 
Target
Name:
Dual specificity protein phosphatase 3
Synonyms:
DUS3_HUMAN Dual specificity protein phosphatase (VHR) Dual specificity protein phosphatase VHR Tyrosine-protein phosphatase non-receptor type 1 | VHR
Type:
Hydrolase
Mol. Mass.:
20480.58
Organism:
Homo sapiens (Human)
Description:
Residue:
185
  
Inhibitor
Name:
BDBM88812
Synonyms:
6-keto-N-(2-methyl-5-piperidinosulfonyl-phenyl)-1H-pyridine-3-carboxamide N-(2-methyl-5-piperidin-1-ylsulfonyl-phenyl)-6-oxidanylidene-1H-pyridine-3-carboxamide N-[2-methyl-5-(1-piperidinylsulfonyl)phenyl]-6-oxo-1H-pyridine-3-carboxamide cid_4826777
Type:
Small organic molecule
Emp. Form.:
C18H21N3O4S
Mol. Mass.:
375.442
SMILES:
Cc1ccc(cc1NC(=O)c1ccc(=O)[nH]c1)S(=O)(=O)N1CCCCC1
: