Target
Mitochondrial import inner membrane translocase subunit TIM23
Ligand
BDBM89070
Substrate
Meas. Tech.
SAR analysis of small molecule inhibitors of tim23-1 yeast via a luminescent assay
IC50
14800±n/a nM
Citation
 PubChem, PC SAR analysis of small molecule inhibitors of tim23-1 yeast via a luminescent assay PubChem Bioassay (2012)[AID] 
Target
Name:
Mitochondrial import inner membrane translocase subunit TIM23
Synonyms:
MAS6 MPI3 TIM23_YEAST | TPA: Essential component of the Translocase of the Inner Mitochondrial membrane (TIM23 complex)
Type:
Enzyme Catalytic Domain
Mol. Mass.:
23245.32
Organism:
Saccharomyces cerevisiae S288c
Description:
gi_285814664
Residue:
222
  
Inhibitor
Name:
BDBM89070
Synonyms:
1,3-benzothiazole-6-carboxylic acid [(Z)-[amino(phenyl)methylene]amino] ester MLS-0454739.0001 [(Z)-[azanyl(phenyl)methylidene]amino] 1,3-benzothiazole-6-carboxylate | cid_9584424
Type:
Small organic molecule
Emp. Form.:
C15H11N3O2S
Mol. Mass.:
297.332
SMILES:
NC(=NOC(=O)c1ccc2ncsc2c1)c1ccccc1
: