Target
Mitochondrial import inner membrane translocase subunit TIM23
Ligand
BDBM89097
Substrate
Meas. Tech.
SAR analysis of small molecule inhibitors of tim23-1 yeast via a luminescent assay
IC50
29600±n/a nM
Citation
 PubChem, PC SAR analysis of small molecule inhibitors of tim23-1 yeast via a luminescent assay PubChem Bioassay (2012)[AID] 
Target
Name:
Mitochondrial import inner membrane translocase subunit TIM23
Synonyms:
MAS6 MPI3 TIM23_YEAST | TPA: Essential component of the Translocase of the Inner Mitochondrial membrane (TIM23 complex)
Type:
Enzyme Catalytic Domain
Mol. Mass.:
23245.32
Organism:
Saccharomyces cerevisiae S288c
Description:
gi_285814664
Residue:
222
  
Inhibitor
Name:
BDBM89097
Synonyms:
2-[(4-keto-7-methyl-pyrido[1,2-a]pyrimidin-2-yl)methylthio]-4,5,6-trimethyl-nicotinamide 4,5,6-trimethyl-2-[(7-methyl-4-oxo-2-pyrido[1,2-a]pyrimidinyl)methylthio]-3-pyridinecarboxamide MLS-0463365.0001 | cid_17478040
Type:
Small organic molecule
Emp. Form.:
C19H20N4O2S
Mol. Mass.:
368.453
SMILES:
Cc1ccc2nc(CSc3nc(C)c(C)c(C)c3C(N)=O)cc(=O)n2c1
: