Target
Mitochondrial import inner membrane translocase subunit TIM23
Ligand
BDBM89123
Substrate
Meas. Tech.
SAR analysis of small molecule inhibitors of tim23-1 yeast via a luminescent assay
IC50
1420±n/a nM
Citation
 PubChem, PC SAR analysis of small molecule inhibitors of tim23-1 yeast via a luminescent assay PubChem Bioassay (2012)[AID] 
Target
Name:
Mitochondrial import inner membrane translocase subunit TIM23
Synonyms:
MAS6 MPI3 TIM23_YEAST | TPA: Essential component of the Translocase of the Inner Mitochondrial membrane (TIM23 complex)
Type:
Enzyme Catalytic Domain
Mol. Mass.:
23245.32
Organism:
Saccharomyces cerevisiae S288c
Description:
gi_285814664
Residue:
222
  
Inhibitor
Name:
BDBM89123
Synonyms:
MLS-0463338.0002 N-[2-(5-methyl-2-furyl)-3H-benzimidazol-5-yl]thiophene-2-carboxamide cid_828654
Type:
Small organic molecule
Emp. Form.:
C17H13N3O2S
Mol. Mass.:
323.369
SMILES:
Cc1ccc(o1)-c1nc2ccc(NC(=O)c3cccs3)cc2[nH]1
: