Target
Mitochondrial import inner membrane translocase subunit TIM23
Ligand
BDBM89132
Substrate
Meas. Tech.
SAR analysis of small molecule inhibitors of tim23-1 yeast via a luminescent assay
IC50
77270±n/a nM
Citation
 PubChem, PC SAR analysis of small molecule inhibitors of tim23-1 yeast via a luminescent assay PubChem Bioassay (2012)[AID] 
Target
Name:
Mitochondrial import inner membrane translocase subunit TIM23
Synonyms:
MAS6 MPI3 TIM23_YEAST | TPA: Essential component of the Translocase of the Inner Mitochondrial membrane (TIM23 complex)
Type:
Enzyme Catalytic Domain
Mol. Mass.:
23245.32
Organism:
Saccharomyces cerevisiae S288c
Description:
gi_285814664
Residue:
222
  
Inhibitor
Name:
BDBM89132
Synonyms:
2-(4-cyclopropylsulfonyl-1-piperazinyl)-6-methyl-1H-benzimidazole 2-(4-cyclopropylsulfonylpiperazino)-6-methyl-1H-benzimidazole cid_45504419
Type:
Small organic molecule
Emp. Form.:
C15H20N4O2S
Mol. Mass.:
320.41
SMILES:
Cc1ccc2nc([nH]c2c1)N1CCN(CC1)S(=O)(=O)C1CC1
: