Target
High affinity choline transporter 1
Ligand
BDBM89165
Substrate
Meas. Tech.
Dose responses of compounds that activate the Choline Transporter (CHT) - 10 point CRC
EC50
13800±n/a nM
Citation
 PubChem, PC Dose responses of compounds that activate the Choline Transporter (CHT) - 10 point CRC PubChem Bioassay (2012)[AID] 
Target
Name:
High affinity choline transporter 1
Synonyms:
CHT1 SC5A7_HUMAN high affinity choline transporter 1
Type:
PROTEIN
Mol. Mass.:
63194.33
Organism:
Homo sapiens (Human)
Description:
ChEMBL_1464247
Residue:
580
  
Inhibitor
Name:
BDBM89165
Synonyms:
2-[2-({[1-(1-adamantyl)ethyl]amino}methyl)-4-bromophenoxy]acetamide hydrochloride 2-[2-[[1-(1-adamantyl)ethylamino]methyl]-4-bromo-phenoxy]acetamide;hydrochloride MLS001000696 cid_2962652
Type:
Small organic molecule
Emp. Form.:
C21H29BrN2O2
Mol. Mass.:
421.371
SMILES:
[H]C12CC3([H])CC([H])(C1)CC(C2)(C3)C(C)NCc1cc(Br)ccc1OCC(N)=O
: