Target
High affinity choline transporter 1
Ligand
BDBM89169
Substrate
Meas. Tech.
Dose responses of compounds that activate the Choline Transporter (CHT) - 10 point CRC
EC50
5760±n/a nM
Citation
 PubChem, PC Dose responses of compounds that activate the Choline Transporter (CHT) - 10 point CRC PubChem Bioassay (2012)[AID] 
Target
Name:
High affinity choline transporter 1
Synonyms:
CHT1 SC5A7_HUMAN high affinity choline transporter 1
Type:
PROTEIN
Mol. Mass.:
63194.33
Organism:
Homo sapiens (Human)
Description:
ChEMBL_1464247
Residue:
580
  
Inhibitor
Name:
BDBM89169
Synonyms:
1,3-bis(phenylmethyl)benzimidazol-3-ium;chloride MLS001201576 cid_2933784
Type:
Small organic molecule
Emp. Form.:
C21H19N2
Mol. Mass.:
299.3884
SMILES:
C(c1ccccc1)n1c[n+](Cc2ccccc2)c2ccccc12
: