Target
Mitochondrial import inner membrane translocase subunit TIM10
Ligand
BDBM89064
Substrate
Meas. Tech.
SAR analysis of small molecule inhibitors of tim23-1: a luminescent tim10-1 yeast counterscreen.
IC50
50220±n/a nM
Citation
 PubChem, PC SAR analysis of small molecule inhibitors of tim23-1: a luminescent tim10-1 yeast counterscreen. PubChem Bioassay (2012)[AID] 
Target
Name:
Mitochondrial import inner membrane translocase subunit TIM10
Synonyms:
MRS11 TIM10_YEAST TPA: Essential protein of the mitochondrial intermembrane space, forms a complex with Tim9p (TIM10 complex) that delivers hydrophobic proteins to the TIM22 complex for insertion into the inner ...
Type:
Enzyme Catalytic Domain
Mol. Mass.:
10303.50
Organism:
Saccharomyces cerevisiae S288c
Description:
gi_285809906
Residue:
93
  
Inhibitor
Name:
BDBM89064
Synonyms:
4-chlorobenzoic acid [(Z)-[amino(2,1,3-benzoxadiazol-5-yl)methylidene]amino] ester MLS-0454733.0001 [(Z)-[azanyl(2,1,3-benzoxadiazol-5-yl)methylidene]amino] 4-chloranylbenzoate | cid_5865054
Type:
Small organic molecule
Emp. Form.:
C14H9ClN4O3
Mol. Mass.:
316.699
SMILES:
N\C(=N/OC(=O)c1ccc(Cl)cc1)c1ccc2nonc2c1
: