Target
Mitochondrial import inner membrane translocase subunit TIM10
Ligand
BDBM89077
Substrate
Meas. Tech.
SAR analysis of small molecule inhibitors of tim23-1: a luminescent tim10-1 yeast counterscreen.
IC50
>99000±n/a nM
Citation
 PubChem, PC SAR analysis of small molecule inhibitors of tim23-1: a luminescent tim10-1 yeast counterscreen. PubChem Bioassay (2012)[AID] 
Target
Name:
Mitochondrial import inner membrane translocase subunit TIM10
Synonyms:
MRS11 TIM10_YEAST TPA: Essential protein of the mitochondrial intermembrane space, forms a complex with Tim9p (TIM10 complex) that delivers hydrophobic proteins to the TIM22 complex for insertion into the inner ...
Type:
Enzyme Catalytic Domain
Mol. Mass.:
10303.50
Organism:
Saccharomyces cerevisiae S288c
Description:
gi_285809906
Residue:
93
  
Inhibitor
Name:
BDBM89077
Synonyms:
MLS-0463348.0001 N-(4-acetylphenyl)-3,7-dimethyl-5-oxo-[1,3]thiazolo[3,2-a]pyrimidine-6-sulfonamide N-(4-ethanoylphenyl)-3,7-dimethyl-5-oxidanylidene-[1,3]thiazolo[3,2-a]pyrimidine-6-sulfonamide | cid_15990253
Type:
Small organic molecule
Emp. Form.:
C16H15N3O4S2
Mol. Mass.:
377.438
SMILES:
CC(=O)c1ccc(NS(=O)(=O)c2c(C)nc3scc(C)n3c2=O)cc1
: