Target
Mitochondrial import inner membrane translocase subunit TIM10
Ligand
BDBM89049
Substrate
Meas. Tech.
SAR analysis of small molecule inhibitors of tim23-1: a luminescent TIM10 yeast counterscreen.
IC50
72700±n/a nM
Citation
 PubChem, PC SAR analysis of small molecule inhibitors of tim23-1: a luminescent TIM10 yeast counterscreen. PubChem Bioassay (2012)[AID] 
Target
Name:
Mitochondrial import inner membrane translocase subunit TIM10
Synonyms:
MRS11 TIM10_YEAST TPA: Essential protein of the mitochondrial intermembrane space, forms a complex with Tim9p (TIM10 complex) that delivers hydrophobic proteins to the TIM22 complex for insertion into the inner ...
Type:
Enzyme Catalytic Domain
Mol. Mass.:
10303.50
Organism:
Saccharomyces cerevisiae S288c
Description:
gi_285809906
Residue:
93
  
Inhibitor
Name:
BDBM89049
Synonyms:
4-(trifluoromethyl)benzoic acid [(Z)-[amino-(2,4-dimethoxyphenyl)methylene]amino] ester MLS-0454719.0001 [(Z)-[azanyl-(2,4-dimethoxyphenyl)methylidene]amino] 4-(trifluoromethyl)benzoate | cid_17558163
Type:
Small organic molecule
Emp. Form.:
C17H15F3N2O4
Mol. Mass.:
368.3072
SMILES:
COc1ccc(C(N)=NOC(=O)c2ccc(cc2)C(F)(F)F)c(OC)c1
: