Target
Mitochondrial import inner membrane translocase subunit TIM10
Ligand
BDBM89051
Substrate
Meas. Tech.
SAR analysis of small molecule inhibitors of tim23-1: a luminescent TIM10 yeast counterscreen.
IC50
2420±n/a nM
Citation
 PubChem, PC SAR analysis of small molecule inhibitors of tim23-1: a luminescent TIM10 yeast counterscreen. PubChem Bioassay (2012)[AID] 
Target
Name:
Mitochondrial import inner membrane translocase subunit TIM10
Synonyms:
MRS11 TIM10_YEAST TPA: Essential protein of the mitochondrial intermembrane space, forms a complex with Tim9p (TIM10 complex) that delivers hydrophobic proteins to the TIM22 complex for insertion into the inner ...
Type:
Enzyme Catalytic Domain
Mol. Mass.:
10303.50
Organism:
Saccharomyces cerevisiae S288c
Description:
gi_285809906
Residue:
93
  
Inhibitor
Name:
BDBM89051
Synonyms:
3-ethoxy-2-naphthalenecarboxylic acid [(Z)-[amino-(4-chlorophenyl)methylidene]amino] ester MLS-0454721.0001 [(Z)-[azanyl-(4-chlorophenyl)methylidene]amino] 3-ethoxynaphthalene-2-carboxylate | cid_17558152
Type:
Small organic molecule
Emp. Form.:
C20H17ClN2O3
Mol. Mass.:
368.814
SMILES:
CCOc1cc2ccccc2cc1C(=O)ON=C(N)c1ccc(Cl)cc1
: