Target
Mitochondrial import inner membrane translocase subunit TIM10
Ligand
BDBM89089
Substrate
Meas. Tech.
SAR analysis of small molecule inhibitors of tim23-1: a luminescent TIM10 yeast counterscreen.
IC50
>99000±n/a nM
Citation
 PubChem, PC SAR analysis of small molecule inhibitors of tim23-1: a luminescent TIM10 yeast counterscreen. PubChem Bioassay (2012)[AID] 
Target
Name:
Mitochondrial import inner membrane translocase subunit TIM10
Synonyms:
MRS11 TIM10_YEAST TPA: Essential protein of the mitochondrial intermembrane space, forms a complex with Tim9p (TIM10 complex) that delivers hydrophobic proteins to the TIM22 complex for insertion into the inner ...
Type:
Enzyme Catalytic Domain
Mol. Mass.:
10303.50
Organism:
Saccharomyces cerevisiae S288c
Description:
gi_285809906
Residue:
93
  
Inhibitor
Name:
BDBM89089
Synonyms:
MLS-0365154.0001 N-(3-chloro-4-morpholin-4-ylphenyl)-3,7-dimethyl-5-oxo-[1,3]thiazolo[3,2-a]pyrimidine-6-sulfonamide N-[3-chloro-4-(4-morpholinyl)phenyl]-3,7-dimethyl-5-oxo-6-thiazolo[3,2-a]pyrimidinesulfonamide | cid_15990076
Type:
Small organic molecule
Emp. Form.:
C18H19ClN4O4S2
Mol. Mass.:
454.951
SMILES:
Cc1csc2nc(C)c(c(=O)n12)S(=O)(=O)Nc1ccc(N2CCOCC2)c(Cl)c1
: