Target
Mitochondrial import inner membrane translocase subunit TIM10
Ligand
BDBM89119
Substrate
Meas. Tech.
SAR analysis of small molecule inhibitors of tim23-1: a luminescent TIM10 yeast counterscreen.
IC50
42900±n/a nM
Citation
 PubChem, PC SAR analysis of small molecule inhibitors of tim23-1: a luminescent TIM10 yeast counterscreen. PubChem Bioassay (2012)[AID] 
Target
Name:
Mitochondrial import inner membrane translocase subunit TIM10
Synonyms:
MRS11 TIM10_YEAST TPA: Essential protein of the mitochondrial intermembrane space, forms a complex with Tim9p (TIM10 complex) that delivers hydrophobic proteins to the TIM22 complex for insertion into the inner ...
Type:
Enzyme Catalytic Domain
Mol. Mass.:
10303.50
Organism:
Saccharomyces cerevisiae S288c
Description:
gi_285809906
Residue:
93
  
Inhibitor
Name:
BDBM89119
Synonyms:
7-bromanyl-2-[(5-morpholin-4-ylsulfonylpyridin-2-yl)sulfanylmethyl]pyrido[1,2-a]pyrimidin-4-one 7-bromo-2-[[(5-morpholinosulfonyl-2-pyridyl)thio]methyl]pyrido[1,2-a]pyrimidin-4-one MLS-0463386.0001 | cid_16232636
Type:
Small organic molecule
Emp. Form.:
C18H17BrN4O4S2
Mol. Mass.:
497.386
SMILES:
Brc1ccc2nc(CSc3ccc(cn3)S(=O)(=O)N3CCOCC3)cc(=O)n2c1
: