Target
Mitochondrial import inner membrane translocase subunit TIM10
Ligand
BDBM89123
Substrate
Meas. Tech.
SAR analysis of small molecule inhibitors of tim23-1: a luminescent TIM10 yeast counterscreen.
IC50
42440±n/a nM
Citation
 PubChem, PC SAR analysis of small molecule inhibitors of tim23-1: a luminescent TIM10 yeast counterscreen. PubChem Bioassay (2012)[AID] 
Target
Name:
Mitochondrial import inner membrane translocase subunit TIM10
Synonyms:
MRS11 TIM10_YEAST TPA: Essential protein of the mitochondrial intermembrane space, forms a complex with Tim9p (TIM10 complex) that delivers hydrophobic proteins to the TIM22 complex for insertion into the inner ...
Type:
Enzyme Catalytic Domain
Mol. Mass.:
10303.50
Organism:
Saccharomyces cerevisiae S288c
Description:
gi_285809906
Residue:
93
  
Inhibitor
Name:
BDBM89123
Synonyms:
MLS-0463338.0002 N-[2-(5-methyl-2-furyl)-3H-benzimidazol-5-yl]thiophene-2-carboxamide cid_828654
Type:
Small organic molecule
Emp. Form.:
C17H13N3O2S
Mol. Mass.:
323.369
SMILES:
Cc1ccc(o1)-c1nc2ccc(NC(=O)c3cccs3)cc2[nH]1
: