Target
DNA (cytosine-5)-methyltransferase 1
Ligand
BDBM47027
Substrate
Meas. Tech.
Dose response confirmation of DNMT1 inhibitors in a Fluorescent Molecular Beacon assay
IC50
3690±74 nM
Citation
 PubChem, PC Dose response confirmation of DNMT1 inhibitors in a Fluorescent Molecular Beacon assay PubChem Bioassay (2012)[AID] 
Target
Name:
DNA (cytosine-5)-methyltransferase 1
Synonyms:
AIM CXXC9 DNA (cytosine-5)-methyltransferase 1 isoform b DNA methyltransferase HsaI DNMT1 M.HsaI | MCMT
Type:
Enzyme
Mol. Mass.:
183184.85
Organism:
Homo sapiens (Human)
Description:
P26358
Residue:
1616
  
Inhibitor
Name:
BDBM47027
Synonyms:
2-(3-brosylpropanoylamino)benzoic acid methyl ester MLS000682776 cid_4293405 methyl 2-[3-(4-bromophenyl)sulfonylpropanoylamino]benzoate
Type:
Small organic molecule
Emp. Form.:
C17H16BrNO5S
Mol. Mass.:
426.282
SMILES:
COC(=O)c1ccccc1NC(=O)CCS(=O)(=O)c1ccc(Br)cc1
: