Target
DNA (cytosine-5)-methyltransferase 1
Ligand
BDBM89205
Substrate
Meas. Tech.
Dose response confirmation of DNMT1 inhibitors in a Fluorescent Molecular Beacon assay
IC50
3390±133 nM
Citation
 PubChem, PC Dose response confirmation of DNMT1 inhibitors in a Fluorescent Molecular Beacon assay PubChem Bioassay (2012)[AID] 
Target
Name:
DNA (cytosine-5)-methyltransferase 1
Synonyms:
AIM CXXC9 DNA (cytosine-5)-methyltransferase 1 isoform b DNA methyltransferase HsaI DNMT1 M.HsaI | MCMT
Type:
Enzyme
Mol. Mass.:
183184.85
Organism:
Homo sapiens (Human)
Description:
P26358
Residue:
1616
  
Inhibitor
Name:
BDBM89205
Synonyms:
2-[[4-[(2E)-2-[(5-bromanyl-2-methoxy-phenyl)methylidene]hydrazinyl]-3-nitro-phenyl]sulfonylamino]benzoic acid 2-[[4-[(N'E)-N'-(5-bromo-2-methoxy-benzylidene)hydrazino]-3-nitro-phenyl]sulfonylamino]benzoic acid SMR001251772 | cid_9684052
Type:
Small organic molecule
Emp. Form.:
C21H17BrN4O7S
Mol. Mass.:
549.351
SMILES:
COc1ccc(Br)cc1[CH-]\N=[NH+]\c1ccc(cc1[N+]([O-])=O)S(=O)(=O)Nc1ccccc1C(O)=O
: