Target
DNA (cytosine-5)-methyltransferase 1
Ligand
BDBM89215
Substrate
Meas. Tech.
Dose response confirmation of DNMT1 inhibitors in a Fluorescent Molecular Beacon assay
IC50
1340±40 nM
Citation
 PubChem, PC Dose response confirmation of DNMT1 inhibitors in a Fluorescent Molecular Beacon assay PubChem Bioassay (2012)[AID] 
Target
Name:
DNA (cytosine-5)-methyltransferase 1
Synonyms:
AIM CXXC9 DNA (cytosine-5)-methyltransferase 1 isoform b DNA methyltransferase HsaI DNMT1 M.HsaI | MCMT
Type:
Enzyme
Mol. Mass.:
183184.85
Organism:
Homo sapiens (Human)
Description:
P26358
Residue:
1616
  
Inhibitor
Name:
BDBM89215
Synonyms:
5,6-Chrysenedione SMR001547316 chrysene-5,6-quinone | cid_16317
Type:
Small organic molecule
Emp. Form.:
C18H10O2
Mol. Mass.:
258.2708
SMILES:
O=C1C(=O)c2c(ccc3ccccc23)-c2ccccc12
: