Target
Apoptotic protease-activating factor 1
Ligand
BDBM22796
Substrate
Meas. Tech.
SAR analysis of small molecule Inhibitors of Apaf-1 in a Fluorescent assay - set 2
IC50
34000±n/a nM
Citation
 PubChem, PC SAR analysis of small molecule Inhibitors of Apaf-1 in a Fluorescent assay - set 2 PubChem Bioassay (2012)[AID] 
Target
Name:
Apoptotic protease-activating factor 1
Synonyms:
APAF1 Apoptotic peptidase activating factor 1 | KIAA0413
Type:
Enzyme Catalytic Domain
Mol. Mass.:
141834.40
Organism:
Homo sapiens (Human)
Description:
O14727
Residue:
1248
  
Inhibitor
Name:
BDBM22796
Synonyms:
1-[(3,4-dichlorophenyl)methyl]-2,3-dihydro-1H-indole-2,3-dione cid_1901244
Type:
Small organic molecule
Emp. Form.:
C15H9Cl2NO2
Mol. Mass.:
306.143
SMILES:
Clc1ccc(CN2C(=O)C(=O)c3ccccc23)cc1Cl
: