Target
Zinc finger protein GLI1
Ligand
BDBM36933
Substrate
Meas. Tech.
Dose response confirmation of uHTS antagonist hits from Gli-SUFU in a luminescent reporter assay
IC50
2720±n/a nM
Citation
 PubChem, PC Dose response confirmation of uHTS antagonist hits from Gli-SUFU in a luminescent reporter assay PubChem Bioassay (2012)[AID] 
Target
Name:
Zinc finger protein GLI1
Synonyms:
GLI1_MOUSE Gli1 | Glioma-associated oncogene homolog
Type:
PROTEIN
Mol. Mass.:
118579.34
Organism:
Mus musculus
Description:
EBI_101259
Residue:
1111
  
Inhibitor
Name:
BDBM36933
Synonyms:
MLS000041708 N-[2-(3,4-dimethoxyphenyl)ethyl]-[1]benzofuro[3,2-d]pyrimidin-4-amine;hydrochloride benzofuro[3,2-d]pyrimidin-4-yl(homoveratryl)amine;hydrochloride | cid_6603430
Type:
Small organic molecule
Emp. Form.:
C20H19N3O3
Mol. Mass.:
349.3832
SMILES:
COc1ccc(CCNc2ncnc3c4ccccc4oc23)cc1OC
: