Target
Apoptotic protease-activating factor 1
Ligand
BDBM89505
Substrate
Meas. Tech.
SAR analysis of small molecule Activators of Apaf-1 in a Fluorescent assay - set 2
EC50
>100000±n/a nM
Citation
 PubChem, PC SAR analysis of small molecule Activators of Apaf-1 in a Fluorescent assay - set 2 PubChem Bioassay (2012)[AID] 
Target
Name:
Apoptotic protease-activating factor 1
Synonyms:
APAF1 Apoptotic peptidase activating factor 1 | KIAA0413
Type:
Enzyme Catalytic Domain
Mol. Mass.:
141834.40
Organism:
Homo sapiens (Human)
Description:
O14727
Residue:
1248
  
Inhibitor
Name:
BDBM89505
Synonyms:
1-(1-pyrazolylmethyl)-1-cyclopropanecarboxylic acid 1-(pyrazol-1-ylmethyl)cyclopropanecarboxylic acid cid_37134560
Type:
Small organic molecule
Emp. Form.:
C8H10N2O2
Mol. Mass.:
166.1772
SMILES:
OC(=O)C1(Cn2cccn2)CC1
: