Target
Caspase-9
Ligand
BDBM89489
Substrate
Meas. Tech.
SAR analysis of small molecule activators of Apaf-1 using a LZ-Caspase-9/Caspase-3 Fluorescent Selectivity assay - Set 2
EC50
>99000±n/a nM
Citation
 PubChem, PC SAR analysis of small molecule activators of Apaf-1 using a LZ-Caspase-9/Caspase-3 Fluorescent Selectivity assay - Set 2 PubChem Bioassay (2012)[AID] 
Target
Name:
Caspase-9
Synonyms:
Apoptotic protease-activating factor 1/Caspase-3/Caspase-9/Cytochrome c CASP-9 CASP9_HUMAN ICE-like apoptotic protease 6 caspase-9 isoform alpha preproprotein
Type:
Enzyme
Mol. Mass.:
46277.29
Organism:
Homo sapiens (Human)
Description:
Residue:
416
  
Inhibitor
Name:
BDBM89489
Synonyms:
3-(4-bromanyl-3,5-dimethyl-pyrazol-1-yl)-2-methyl-propanoic acid 3-(4-bromo-3,5-dimethyl-pyrazol-1-yl)-2-methyl-propionic acid MLS-0463286.0001 | cid_6457554
Type:
Small organic molecule
Emp. Form.:
C9H13BrN2O2
Mol. Mass.:
261.116
SMILES:
CC(Cn1nc(C)c(Br)c1C)C(O)=O
: