Target
Corticotropin-releasing factor-binding protein
Ligand
BDBM89700
Substrate
Meas. Tech.
Dose Response confirmation of uHTS hits for small molecule agonists of the CRF-binding protein and CRF-R2 receptor complex
EC50
>53000±n/a nM
Citation
 PubChem, PC Dose Response confirmation of uHTS hits for small molecule agonists of the CRF-binding protein and CRF-R2 receptor complex PubChem Bioassay (2012)[AID] 
Target
Name:
Corticotropin-releasing factor-binding protein
Synonyms:
CRFBP CRHBP_HUMAN | corticotropin releasing factor-binding protein
Type:
Enzyme Catalytic Domain
Mol. Mass.:
36143.95
Organism:
Homo sapiens (Human)
Description:
P24387
Residue:
322
  
Inhibitor
Name:
BDBM89700
Synonyms:
4-chloranyl-N-methyl-N-[(3-pyridin-2-yl-1,2,4-oxadiazol-5-yl)methyl]benzenesulfonamide 4-chloro-N-methyl-N-[[3-(2-pyridinyl)-1,2,4-oxadiazol-5-yl]methyl]benzenesulfonamide 4-chloro-N-methyl-N-{[3-(2-pyridinyl)-1,2,4-oxadiazol-5-yl]methyl}benzenesulfonamide SMR000077877 | cid_1300325
Type:
Small organic molecule
Emp. Form.:
C15H13ClN4O3S
Mol. Mass.:
364.807
SMILES:
CN(Cc1nc(no1)-c1ccccn1)S(=O)(=O)c1ccc(Cl)cc1
: