Target
Corticotropin-releasing factor-binding protein
Ligand
BDBM90967
Substrate
Meas. Tech.
Dose Response confirmation of uHTS hits for small molecule agonists of the CRF-binding protein and CRF-R2 receptor complex
EC50
>53000±n/a nM
Citation
 PubChem, PC Dose Response confirmation of uHTS hits for small molecule agonists of the CRF-binding protein and CRF-R2 receptor complex PubChem Bioassay (2012)[AID] 
Target
Name:
Corticotropin-releasing factor-binding protein
Synonyms:
CRFBP CRHBP_HUMAN | corticotropin releasing factor-binding protein
Type:
Enzyme Catalytic Domain
Mol. Mass.:
36143.95
Organism:
Homo sapiens (Human)
Description:
P24387
Residue:
322
  
Inhibitor
Name:
BDBM90967
Synonyms:
3-[6-(benzylamino)-[1,2,4]triazolo[4,3-b]pyridazin-3-yl]-N-[3-(2-furyl)-1-methyl-propyl]propionamide MLS001095878 N-[4-(furan-2-yl)butan-2-yl]-3-[6-[(phenylmethyl)amino]-[1,2,4]triazolo[4,3-b]pyridazin-3-yl]propanamide cid_20956960
Type:
Small organic molecule
Emp. Form.:
C23H26N6O2
Mol. Mass.:
418.4915
SMILES:
CC(CCc1ccco1)NC(=O)CCc1nnc2ccc(NCc3ccccc3)nn12
: