Target
Beta-2 adrenergic receptor
Ligand
BDBM77324
Substrate
Meas. Tech.
Dose response for HTS for Beta-2AR agonists via FAP method from Powderset3
EC50
60.9±n/a nM
Citation
 PubChem, PC Dose response for HTS for Beta-2AR agonists via FAP method from Powderset3 PubChem Bioassay (2012)[AID] 
Target
Name:
Beta-2 adrenergic receptor
Synonyms:
ADRB2 ADRB2_HUMAN Beta-2 adrenoceptor | Beta-2 adrenoreceptor
Type:
Mol. Mass.:
46461.69
Organism:
Homo sapiens (Human)
Description:
P07550
Residue:
413
  
Inhibitor
Name:
BDBM77324
Synonyms:
MLS000531823 N-benzyl-4-(benzylsulfonylamino)-N-methylbenzenesulfonamide N-methyl-N-(phenylmethyl)-4-[(phenylmethyl)sulfonylamino]benzenesulfonamide cid_1025603
Type:
Small organic molecule
Emp. Form.:
C21H22N2O4S2
Mol. Mass.:
430.54
SMILES:
CN(Cc1ccccc1)S(=O)(=O)c1ccc(NS(=O)(=O)Cc2ccccc2)cc1
: