Target
Mitochondrial peptide methionine sulfoxide reductase
Ligand
BDBM60840
Substrate
Meas. Tech.
Absorbance-based biochemical high throughput dose response assay for activators of Methionine sulfoxide reductase A (MsrA)
EC50
>103879±n/a nM
Citation
 PubChem, PC Absorbance-based biochemical high throughput dose response assay for activators of Methionine sulfoxide reductase A (MsrA) PubChem Bioassay (2012)[AID] 
Target
Name:
Mitochondrial peptide methionine sulfoxide reductase
Synonyms:
MSRA MSRA_BOVIN
Type:
Enzyme Catalytic Domain
Mol. Mass.:
25822.90
Organism:
Bos taurus
Description:
gi_73586699
Residue:
233
  
Inhibitor
Name:
BDBM60840
Synonyms:
2,2'-dithiodipyridine 2-(2-pyridyldisulfanyl)pyridine MLS001143364 cid_65093
Type:
Small organic molecule
Emp. Form.:
C10H8N2S2
Mol. Mass.:
220.314
SMILES:
S(Sc1ccccn1)c1ccccn1
: