Target
Mitochondrial peptide methionine sulfoxide reductase
Ligand
BDBM61641
Substrate
Meas. Tech.
Absorbance-based biochemical high throughput dose response assay for activators of Methionine sulfoxide reductase A (MsrA)
EC50
>103909±n/a nM
Citation
 PubChem, PC Absorbance-based biochemical high throughput dose response assay for activators of Methionine sulfoxide reductase A (MsrA) PubChem Bioassay (2012)[AID] 
Target
Name:
Mitochondrial peptide methionine sulfoxide reductase
Synonyms:
MSRA MSRA_BOVIN
Type:
Enzyme Catalytic Domain
Mol. Mass.:
25822.90
Organism:
Bos taurus
Description:
gi_73586699
Residue:
233
  
Inhibitor
Name:
BDBM61641
Synonyms:
5-[4-(diethylamino)phenyl]-4-(4-fluorophenyl)-N-phenyl-1,3,4-thiadiazol-4-ium-2-amine;chloride SMR000526926 cid_24789825
Type:
Small organic molecule
Emp. Form.:
C24H24FN4S
Mol. Mass.:
419.537
SMILES:
CCN(CC)c1ccc(cc1)-c1sc(Nc2ccccc2)n[n+]1-c1ccc(F)cc1
: