Target
Mitochondrial peptide methionine sulfoxide reductase
Ligand
BDBM80067
Substrate
Meas. Tech.
Absorbance-based biochemical high throughput dose response assay for activators of Methionine sulfoxide reductase A (MsrA)
EC50
34146±n/a nM
Citation
 PubChem, PC Absorbance-based biochemical high throughput dose response assay for activators of Methionine sulfoxide reductase A (MsrA) PubChem Bioassay (2012)[AID] 
Target
Name:
Mitochondrial peptide methionine sulfoxide reductase
Synonyms:
MSRA MSRA_BOVIN
Type:
Enzyme Catalytic Domain
Mol. Mass.:
25822.90
Organism:
Bos taurus
Description:
gi_73586699
Residue:
233
  
Inhibitor
Name:
BDBM80067
Synonyms:
MLS002693850 N-(1,4-dioxo-2-naphthalenyl)benzamide N-[1,4-bis(oxidanylidene)naphthalen-2-yl]benzamide cid_4882
Type:
Small organic molecule
Emp. Form.:
C17H11NO3
Mol. Mass.:
277.2741
SMILES:
O=C(NC1=CC(=O)c2ccccc2C1=O)c1ccccc1
: