Target
Mitochondrial peptide methionine sulfoxide reductase
Ligand
BDBM91516
Substrate
Meas. Tech.
Absorbance-based biochemical high throughput dose response assay for activators of Methionine sulfoxide reductase A (MsrA)
EC50
12900±n/a nM
Citation
 PubChem, PC Absorbance-based biochemical high throughput dose response assay for activators of Methionine sulfoxide reductase A (MsrA) PubChem Bioassay (2012)[AID] 
Target
Name:
Mitochondrial peptide methionine sulfoxide reductase
Synonyms:
MSRA MSRA_BOVIN
Type:
Enzyme Catalytic Domain
Mol. Mass.:
25822.90
Organism:
Bos taurus
Description:
gi_73586699
Residue:
233
  
Inhibitor
Name:
BDBM91516
Synonyms:
(4-dithiolanylideneamino)thiourea 1-(1,2-dithiolan-4-ylideneamino)thiourea SMR001822095 | cid_3000655
Type:
Small organic molecule
Emp. Form.:
C4H7N3S3
Mol. Mass.:
193.313
SMILES:
[#7]-[#6](=S)-[#7]\[#7]=[#6]-1/[#6]-[#16]-[#16]-[#6]-1
: