Target
Mitochondrial peptide methionine sulfoxide reductase
Ligand
BDBM61923
Substrate
Meas. Tech.
Absorbance-based biochemical high throughput dose response assay for activators of Methionine sulfoxide reductase A (MsrA)
EC50
>103919±n/a nM
Citation
 PubChem, PC Absorbance-based biochemical high throughput dose response assay for activators of Methionine sulfoxide reductase A (MsrA) PubChem Bioassay (2012)[AID] 
Target
Name:
Mitochondrial peptide methionine sulfoxide reductase
Synonyms:
MSRA MSRA_BOVIN
Type:
Enzyme Catalytic Domain
Mol. Mass.:
25822.90
Organism:
Bos taurus
Description:
gi_73586699
Residue:
233
  
Inhibitor
Name:
BDBM61923
Synonyms:
KSC-6-110 N-(3-keto-2-phenyl-1,2-benzothiazol-5-yl)acetamide N-(3-oxo-2-phenyl-1,2-benzothiazol-5-yl)acetamide | cid_44593869
Type:
Small organic molecule
Emp. Form.:
C15H12N2O2S
Mol. Mass.:
284.333
SMILES:
CC(=O)Nc1ccc2sn(-c3ccccc3)c(=O)c2c1
: