Target
Multidrug efflux pump
Ligand
BDBM91521
Substrate
Meas. Tech.
Dose Response HTS singleplex for inhibitors of yeast efflux pump, specifically Mdr1 with Cherry Pick2 compound set
EC50
29730±n/a nM
Citation
 PubChem, PC Dose Response HTS singleplex for inhibitors of yeast efflux pump, specifically Mdr1 with Cherry Pick2 compound set PubChem Bioassay (2012)[AID] 
Target
Name:
Multidrug efflux pump
Synonyms:
Candida albicans strain ATCC 10261 multidrug efflux pump (MDR1) gene, MDR1-A allele, complete cds
Type:
Enzyme Catalytic Domain
Mol. Mass.:
62915.82
Organism:
Candida albicans
Description:
Q09GR2
Residue:
564
  
Inhibitor
Name:
BDBM91521
Synonyms:
MLS000877382 cid_16746082
Type:
Small organic molecule
Emp. Form.:
C28H23FN2O4S
Mol. Mass.:
502.557
SMILES:
Fc1ccc2OC3(CCN(CC3)C(=O)\C=C\c3cccs3)C3(CC(=NO3)c3ccccc3)C(=O)c2c1
: