Target
DNA dC->dU-editing enzyme APOBEC-3A
Ligand
BDBM1516
Substrate
Meas. Tech.
SAR analysis of small molecule inhibitors of APOBEC3A DNA Deaminase via a fluorescence-based single-stranded DNA deaminase assay - Set 2
Temperature
298.15±n/a K
IC50
>99000±n/a nM
Comments
extracted
Citation
 PubChem, PC SAR analysis of small molecule inhibitors of APOBEC3A DNA Deaminase via a fluorescence-based single-stranded DNA deaminase assay - Set 2 PubChem Bioassay (2012)[AID] 
Target
Name:
DNA dC->dU-editing enzyme APOBEC-3A
Synonyms:
ABC3A_HUMAN probable DNA dC->dU-editing enzyme APOBEC-3A
Type:
Enzyme Catalytic Domain
Mol. Mass.:
23013.77
Organism:
Homo sapiens (Human)
Description:
gi_21955158
Residue:
199
  
Inhibitor
Name:
BDBM1516
Synonyms:
cid_2236914
Type:
Emp. Form.:
C15H11ClN4O3
Mol. Mass.:
330.726
SMILES:
Clc1c(nn2cccnc12)C(=O)NCc1ccc2OCOc2c1
: