Target
DNA dC->dU-editing enzyme APOBEC-3A
Ligand
BDBM66135
Substrate
Meas. Tech.
SAR analysis of small molecule inhibitors of APOBEC3A DNA Deaminase via a fluorescence-based single-stranded DNA deaminase assay - Set 2
Temperature
298.15±n/a K
IC50
>99000±n/a nM
Comments
extracted
Citation
 PubChem, PC SAR analysis of small molecule inhibitors of APOBEC3A DNA Deaminase via a fluorescence-based single-stranded DNA deaminase assay - Set 2 PubChem Bioassay (2012)[AID] 
Target
Name:
DNA dC->dU-editing enzyme APOBEC-3A
Synonyms:
ABC3A_HUMAN probable DNA dC->dU-editing enzyme APOBEC-3A
Type:
Enzyme Catalytic Domain
Mol. Mass.:
23013.77
Organism:
Homo sapiens (Human)
Description:
gi_21955158
Residue:
199
  
Inhibitor
Name:
BDBM66135
Synonyms:
5-methyl-3-[(E)-2-(1-methyl-4-pyridin-1-iumyl)ethenyl]-1H-indole;iodide 5-methyl-3-[(E)-2-(1-methylpyridin-1-ium-4-yl)vinyl]-1H-indole;iodide SMR000544817 | cid_24761146
Type:
Small organic molecule
Emp. Form.:
C17H17N2
Mol. Mass.:
249.3297
SMILES:
Cc1ccc2[nH]cc(\C=C\c3cc[n+](C)cc3)c2c1
: