Target
DNA dC->dU-editing enzyme APOBEC-3A
Ligand
BDBM50260481
Substrate
Meas. Tech.
SAR analysis of small molecule inhibitors of APOBEC3A DNA Deaminase via a fluorescence-based single-stranded DNA deaminase assay - Set 2
Temperature
298.15±n/a K
IC50
>99000±n/a nM
Comments
extracted
Citation
 PubChem, PC SAR analysis of small molecule inhibitors of APOBEC3A DNA Deaminase via a fluorescence-based single-stranded DNA deaminase assay - Set 2 PubChem Bioassay (2012)[AID] 
Target
Name:
DNA dC->dU-editing enzyme APOBEC-3A
Synonyms:
ABC3A_HUMAN probable DNA dC->dU-editing enzyme APOBEC-3A
Type:
Enzyme Catalytic Domain
Mol. Mass.:
23013.77
Organism:
Homo sapiens (Human)
Description:
gi_21955158
Residue:
199
  
Inhibitor
Name:
BDBM50260481
Synonyms:
5-Methyl-8,9,10,11-tetrahydro[1]benzothieno[3,2-e][1,2,4]triazolo[4,3-c]pyrimidine-3(2H)-thione cid_714639
Type:
Small organic molecule
Emp. Form.:
C12H12N4S2
Mol. Mass.:
276.38
SMILES:
Cc1nc2sc3CCCCc3c2c2n[nH]c(=S)n12
: