Target
DNA dC->dU-editing enzyme APOBEC-3A
Ligand
BDBM91537
Substrate
Meas. Tech.
SAR analysis of small molecule inhibitors of APOBEC3A DNA Deaminase via a fluorescence-based single-stranded DNA deaminase assay - Set 2
Temperature
298.15±n/a K
IC50
88900±n/a nM
Comments
extracted
Citation
 PubChem, PC SAR analysis of small molecule inhibitors of APOBEC3A DNA Deaminase via a fluorescence-based single-stranded DNA deaminase assay - Set 2 PubChem Bioassay (2012)[AID] 
Target
Name:
DNA dC->dU-editing enzyme APOBEC-3A
Synonyms:
ABC3A_HUMAN probable DNA dC->dU-editing enzyme APOBEC-3A
Type:
Enzyme Catalytic Domain
Mol. Mass.:
23013.77
Organism:
Homo sapiens (Human)
Description:
gi_21955158
Residue:
199
  
Inhibitor
Name:
BDBM91537
Synonyms:
7-(1,5-dimethyl-4-pyrazolyl)-2-pyrazolo[1,5-a]pyrimidinecarboxylic acid MLS-0259267.0001 | cid_4774543
Type:
Small organic molecule
Emp. Form.:
C12H11N5O2
Mol. Mass.:
257.248
SMILES:
Cc1c(cnn1C)-c1ccnc2cc(nn12)C(O)=O
: