Target
Tyrosine-protein phosphatase non-receptor type 5
Ligand
BDBM88736
Substrate
Meas. Tech.
Dose response orthogonal assay of uHTS small molecule inhibitors of Striatal-Enriched Phosphatase via a colorimetric intensity assay.
IC50
40300±n/a nM
Citation
 PubChem, PC Dose response orthogonal assay of uHTS small molecule inhibitors of Striatal-Enriched Phosphatase via a colorimetric intensity assay. PubChem Bioassay (2012)[AID] 
Target
Name:
Tyrosine-protein phosphatase non-receptor type 5
Synonyms:
PTN5_HUMAN Tyrosine-protein phosphatase non-receptor type 5 | Tyrosine-protein phosphatase non-receptor type 5 isoform a
Type:
Enzyme Catalytic Domain
Mol. Mass.:
63510.68
Organism:
Homo sapiens (Human)
Description:
gi_90652859
Residue:
565
  
Inhibitor
Name:
BDBM88736
Synonyms:
MLS000584580 N-(3-chloro-4-methoxy-phenyl)-4-[methyl(tetrahydrofurfuryl)amino]piperidine-1-carbothioamide N-(3-chloro-4-methoxyphenyl)-4-[methyl(oxolan-2-ylmethyl)amino]piperidine-1-carbothioamide SMR000207165 | cid_4112942
Type:
Small organic molecule
Emp. Form.:
C19H28ClN3O2S
Mol. Mass.:
397.963
SMILES:
COc1ccc(NC(=S)N2CCC(CC2)N(C)CC2CCCO2)cc1Cl
: