Target
Tyrosine-protein phosphatase non-receptor type 5
Ligand
BDBM88743
Substrate
Meas. Tech.
Dose response orthogonal assay of uHTS small molecule inhibitors of Striatal-Enriched Phosphatase via a colorimetric intensity assay.
IC50
>80000±n/a nM
Citation
 PubChem, PC Dose response orthogonal assay of uHTS small molecule inhibitors of Striatal-Enriched Phosphatase via a colorimetric intensity assay. PubChem Bioassay (2012)[AID] 
Target
Name:
Tyrosine-protein phosphatase non-receptor type 5
Synonyms:
PTN5_HUMAN Tyrosine-protein phosphatase non-receptor type 5 | Tyrosine-protein phosphatase non-receptor type 5 isoform a
Type:
Enzyme Catalytic Domain
Mol. Mass.:
63510.68
Organism:
Homo sapiens (Human)
Description:
gi_90652859
Residue:
565
  
Inhibitor
Name:
BDBM88743
Synonyms:
1-(3-isopropoxypropyl)-3-(4-sulfamoylphenyl)thiourea 4-({[(3-isopropoxypropyl)amino]carbothioyl}amino)benzenesulfonamide SMR000231045 | cid_2716725
Type:
Small organic molecule
Emp. Form.:
C13H21N3O3S2
Mol. Mass.:
331.454
SMILES:
CC(C)OCCCNC(=S)Nc1ccc(cc1)S(N)(=O)=O
: