Target
Tyrosine-protein phosphatase non-receptor type 5
Ligand
BDBM88767
Substrate
Meas. Tech.
Dose response orthogonal assay of uHTS small molecule inhibitors of Striatal-Enriched Phosphatase via a colorimetric intensity assay.
IC50
56000±n/a nM
Citation
 PubChem, PC Dose response orthogonal assay of uHTS small molecule inhibitors of Striatal-Enriched Phosphatase via a colorimetric intensity assay. PubChem Bioassay (2012)[AID] 
Target
Name:
Tyrosine-protein phosphatase non-receptor type 5
Synonyms:
PTN5_HUMAN Tyrosine-protein phosphatase non-receptor type 5 | Tyrosine-protein phosphatase non-receptor type 5 isoform a
Type:
Enzyme Catalytic Domain
Mol. Mass.:
63510.68
Organism:
Homo sapiens (Human)
Description:
gi_90652859
Residue:
565
  
Inhibitor
Name:
BDBM88767
Synonyms:
1-[2-(dimethylamino)ethyl]-3-(2,4-dimethylphenyl)-1-(2-thenyl)thiourea MLS000689439 SMR000311238 | cid_3390606
Type:
Small organic molecule
Emp. Form.:
C18H25N3S2
Mol. Mass.:
347.541
SMILES:
CN(C)CCN(Cc1cccs1)C(=S)Nc1ccc(C)cc1C
: