Target
Tyrosine-protein phosphatase non-receptor type 22
Ligand
BDBM88730
Substrate
Meas. Tech.
Dose Response selectivity of inhibitors of STriatal-Enriched Phosphatase (STEP) in the Lymphoid Phosphatase (PTPN22) Inhibition Assay
IC50
29882±6980 nM
Citation
 PubChem, PC Dose Response selectivity of inhibitors of STriatal-Enriched Phosphatase (STEP) in the Lymphoid Phosphatase (PTPN22) Inhibition Assay PubChem Bioassay (2012)[AID] 
Target
Name:
Tyrosine-protein phosphatase non-receptor type 22
Synonyms:
3.1.3.48 LyP Lymphoid phosphatase (Lyp) PEST-domain phosphatase PTPN22 Tyrosine-protein phosphatase non-receptor type 22 (LYP) | tyrosine-protein phosphatase non-receptor type 22 isoform 1
Type:
Mol. Mass.:
91712.31
Organism:
Homo sapiens (Human)
Description:
Q9Y2R2
Residue:
807
  
Inhibitor
Name:
BDBM88730
Synonyms:
MLS000574482 N-[5-(1H-benzimidazol-2-yl)-2-chloro-phenyl]-4-ethoxy-3-nitro-benzamide SMR000195146 | cid_1338419
Type:
Small organic molecule
Emp. Form.:
C22H17ClN4O4
Mol. Mass.:
436.848
SMILES:
CCOc1ccc(cc1[N+]([O-])=O)C(=O)Nc1cc(ccc1Cl)-c1nc2ccccc2[nH]1
: