Target
Tyrosine-protein phosphatase non-receptor type 22
Ligand
BDBM88783
Substrate
Meas. Tech.
Dose Response selectivity of inhibitors of STriatal-Enriched Phosphatase (STEP) in the Lymphoid Phosphatase (PTPN22) Inhibition Assay
IC50
>100000±0 nM
Citation
 PubChem, PC Dose Response selectivity of inhibitors of STriatal-Enriched Phosphatase (STEP) in the Lymphoid Phosphatase (PTPN22) Inhibition Assay PubChem Bioassay (2012)[AID] 
Target
Name:
Tyrosine-protein phosphatase non-receptor type 22
Synonyms:
3.1.3.48 LyP Lymphoid phosphatase (Lyp) PEST-domain phosphatase PTPN22 Tyrosine-protein phosphatase non-receptor type 22 (LYP) | tyrosine-protein phosphatase non-receptor type 22 isoform 1
Type:
Mol. Mass.:
91712.31
Organism:
Homo sapiens (Human)
Description:
Q9Y2R2
Residue:
807
  
Inhibitor
Name:
BDBM88783
Synonyms:
MLS001216500 N-[(E)-(4-ethoxyphenyl)methylideneamino]-4-methoxy-1H-indole-2-carboxamide cid_6878296
Type:
Small organic molecule
Emp. Form.:
C19H19N3O3
Mol. Mass.:
337.3725
SMILES:
CCOc1ccc(\C=N\NC(=O)c2cc3c(OC)cccc3[nH]2)cc1
: