Target
Tyrosine-protein phosphatase non-receptor type 22
Ligand
BDBM88790
Substrate
Meas. Tech.
Dose Response selectivity of inhibitors of STriatal-Enriched Phosphatase (STEP) in the Lymphoid Phosphatase (PTPN22) Inhibition Assay
IC50
44198±1380 nM
Citation
 PubChem, PC Dose Response selectivity of inhibitors of STriatal-Enriched Phosphatase (STEP) in the Lymphoid Phosphatase (PTPN22) Inhibition Assay PubChem Bioassay (2012)[AID] 
Target
Name:
Tyrosine-protein phosphatase non-receptor type 22
Synonyms:
3.1.3.48 LyP Lymphoid phosphatase (Lyp) PEST-domain phosphatase PTPN22 Tyrosine-protein phosphatase non-receptor type 22 (LYP) | tyrosine-protein phosphatase non-receptor type 22 isoform 1
Type:
Mol. Mass.:
91712.31
Organism:
Homo sapiens (Human)
Description:
Q9Y2R2
Residue:
807
  
Inhibitor
Name:
BDBM88790
Synonyms:
4-[({[(2E)-3-(4-chlorophenyl)prop-2-enoyl]amino}carbonothioyl)amino]benzoic acid 4-[[(E)-3-(4-chlorophenyl)prop-2-enoyl]carbamothioylamino]benzoic acid MLS001196128 cid_1329095
Type:
Small organic molecule
Emp. Form.:
C17H13ClN2O3S
Mol. Mass.:
360.815
SMILES:
OC(=O)c1ccc(NC(=S)NC(=O)C=Cc2ccc(Cl)cc2)cc1
: