Target
Botulinum neurotoxin type A
Ligand
BDBM91547
Substrate
Meas. Tech.
High-throughput multiplex microsphere dose response for inhibitors of toxin protease, specifically Botulinum neurotoxin light chain A protease, compounds from Powder Set 01
EC50
6100±n/a nM
Citation
 PubChem, PC High-throughput multiplex microsphere dose response for inhibitors of toxin protease, specifically Botulinum neurotoxin light chain A protease, compounds from Powder Set 01 PubChem Bioassay (2012)[AID] 
Target
Name:
Botulinum neurotoxin type A
Synonyms:
BXA1_CLOBH bna | botA
Type:
PROTEIN
Mol. Mass.:
149421.96
Organism:
Clostridium botulinum (strain Hall / ATCC 3502 / NCTC 13319 / Type A)
Description:
ChEMBL_987932
Residue:
1296
  
Inhibitor
Name:
BDBM91547
Synonyms:
N-(2,3-dithiophen-2-yl-6-quinoxalinyl)-1-piperidinecarboxamide N-[2,3-bis(2-thienyl)quinoxalin-6-yl]piperidine-1-carboxamide cid_1329560
Type:
Small organic molecule
Emp. Form.:
C22H20N4OS2
Mol. Mass.:
420.55
SMILES:
O=C(Nc1ccc2nc(-c3cccs3)c(nc2c1)-c1cccs1)N1CCCCC1
: