Target
Botulinum neurotoxin type F
Ligand
BDBM67478
Substrate
Meas. Tech.
High-throughput multiplex microsphere dose response for inhibitors of toxin protease, specifically Botulinum neurotoxin light chain F protease, compounds from Powder Set 01
EC50
>20000±n/a nM
Citation
 PubChem, PC High-throughput multiplex microsphere dose response for inhibitors of toxin protease, specifically Botulinum neurotoxin light chain F protease, compounds from Powder Set 01 PubChem Bioassay (2012)[AID] 
Target
Name:
Botulinum neurotoxin type F
Synonyms:
BXF_CLOBO botulinum neurotoxin type F, BoNT/F
Type:
Enzyme Catalytic Domain
Mol. Mass.:
146691.56
Organism:
Clostridium botulinum Bf
Description:
P30996
Residue:
1274
  
Inhibitor
Name:
BDBM67478
Synonyms:
2,4,5-triphenyl-1,3-oxazole SR-03000000699-1 | cid_275930
Type:
Small organic molecule
Emp. Form.:
C21H15NO
Mol. Mass.:
297.3499
SMILES:
c1ccc(cc1)-c1nc(c(o1)-c1ccccc1)-c1ccccc1
: