Target
Botulinum neurotoxin type F
Ligand
BDBM62820
Substrate
Meas. Tech.
High-throughput multiplex microsphere dose response for inhibitors of toxin protease, specifically Botulinum neurotoxin light chain F protease, compounds from Powder Set 01
EC50
>20000±n/a nM
Citation
 PubChem, PC High-throughput multiplex microsphere dose response for inhibitors of toxin protease, specifically Botulinum neurotoxin light chain F protease, compounds from Powder Set 01 PubChem Bioassay (2012)[AID] 
Target
Name:
Botulinum neurotoxin type F
Synonyms:
BXF_CLOBO botulinum neurotoxin type F, BoNT/F
Type:
Enzyme Catalytic Domain
Mol. Mass.:
146691.56
Organism:
Clostridium botulinum Bf
Description:
P30996
Residue:
1274
  
Inhibitor
Name:
BDBM62820
Synonyms:
2-methyl-N-[2-(2-methyl-1-indolyl)ethyl]propanamide 2-methyl-N-[2-(2-methylindol-1-yl)ethyl]propionamide SMR000016274 | cid_3335282
Type:
Small organic molecule
Emp. Form.:
C15H20N2O
Mol. Mass.:
244.3321
SMILES:
CC(C)C(=O)NCCn1c(C)cc2ccccc12
: